5α-Androstan-17β-ol-3-one, VDMS
- Formula: C23H38O2Si
- Molecular weight: 374.6321
- IUPAC Standard InChIKey: BQMPHVFWKDRPIA-RNAHECHESA-N
- Chemical structure:

Normal alkane RI, non-polar column, temperature ramp

Column type | Active phase | I | Reference | Comment |
---|---|---|---|---|
Packed | SE-30 | 2658. | Harvey, 1980 | N2, Gas Chrom Q, 4. K/min; Column length: 2. m; Tstart: 150. C; Tend: 300. C |

References

Harvey, 1980
Harvey, D.J.,
Vinyldimethylsilyl ethers as derivative for the characterization of steroids and cannabinoids by gas chromatography mass spectrometry,
Biomed. Mass Spectrom., 1980, 7, 5, 211-216, https://doi.org/10.1002/bms.1200070507
. [all data]