5-Pregnene-3β,20β,21-triol, methylboronate-TMS
- Formula: C25H43BO3Si
- Molecular weight: 430.504
- IUPAC Standard InChIKey: DYSJFFIPZVHTFM-PHLWBJBFSA-N
- Chemical structure:

Normal alkane RI, non-polar column, isothermal

Column type | Active phase | Temperature (C) | I | Reference | Comment |
---|---|---|---|---|---|
Capillary | OV-1 | 240. | 2870. | Brooks, Cole, et al., 1980 | Helium; Column length: 25. m; Column diameter: 0.50 mm |

References

Brooks, Cole, et al., 1980
Brooks, C.J.W.; Cole, W.J.; McIntyre, H.B.; Smith, A.G.,
Selective reactions in the analysis and characterization of steroids by gas chromatography-mass spectrometry,
Lipids, 1980, 15, 9, 745-755, https://doi.org/10.1007/BF02534028
. [all data]