5-Pregnene-3β,20,21-triol, methylboronate-TMS

Normal alkane RI, non-polar column, isothermal

View large format table.

Column type Active phase Temperature (C) I Reference Comment
CapillaryOV-1240.2895.Brooks, Cole, et al., 1980Helium; Column length: 25. m; Column diameter: 0.50 mm

References

Brooks, Cole, et al., 1980
Brooks, C.J.W.; Cole, W.J.; McIntyre, H.B.; Smith, A.G., Selective reactions in the analysis and characterization of steroids by gas chromatography-mass spectrometry, Lipids, 1980, 15, 9, 745-755, https://doi.org/10.1007/BF02534028 . [all data]