12-Tritriacontene
- Formula: C30H60
- Molecular weight: 420.7974
- IUPAC Standard InChIKey: UXBBYDBWOJZQJD-WJTDDFOZSA-N
- Chemical structure:
View 3d structure (requires JavaScript / HTML 5) - Permanent link for this species. Use this link for bookmarking this species for future reference.

Normal alkane RI, non-polar column, temperature ramp

Column type | Active phase | I | Reference | Comment |
---|---|---|---|---|
Capillary | Dexsil 300 | 3278. | Lockey, 1978 | 5. K/min; Column length: 15. m; Tstart: 50. C; Tend: 370. C |

References

Lockey, 1978
Lockey, K.H.,
The adult cuticular hydrocarbons of Tenebrio Molitor L. and Tenebrio Obscurus F. (Coleoptera: Tenebrionidae),
Insect Biochem., 1978, 8, 4, 237-250, https://doi.org/10.1016/0020-1790(78)90032-X
. [all data]