11,15,22-Trimethyltetracontane

Normal alkane RI, non-polar column, temperature ramp

View large format table.

Column type Active phase I Reference Comment
PackedDexsil 3003549.Lockey, 1976Nitrogen, Chromosorb W (80-100 mesh), 3.3 K/min; Column length: 2. m; Tstart: 80. C; Tend: 340. C

References

Lockey, 1976
Lockey, K.H., Cuticular hydrocarbons of Locusta, Schistocerca, and Periplaneta, and their role in waterproofing, Insect Biochem., 1976, 6, 5, 457-472, https://doi.org/10.1016/0020-1790(76)90068-8 . [all data]