16,17-diepi-Oestriol, TMS

Normal alkane RI, non-polar column, isothermal

View large format table.

Column type Active phase Temperature (C) I Reference Comment
PackedOV-1200.2815.Dehennin and Scholler, 1969N2, Gas-Chrom Q; Column length: 1.50 m
PackedOV-1200.2823.Dehennin and Scholler, 1969N2, Gas-Chrom Q; Column length: 1.50 m

References

Dehennin and Scholler, 1969
Dehennin, L.; Scholler, R., Correlation entre la structure moleculaire de quelques steroides en C18 et leurs grandeurs de retention en chromatographie en phase gazeuse, J. Steroid Biochem., 1969, 1, 1, 57-76, https://doi.org/10.1016/0022-4731(69)90009-0 . [all data]