20α-Dihydropregnenolone, MO-TMS
- Formula: C27H50O2Si2
- Molecular weight: 462.8557
- IUPAC Standard InChIKey: PXQKWIROLXRMAD-WMLRFPDFSA-N
- Chemical structure:
View 3d structure (requires JavaScript / HTML 5) - Species with the same structure:
- Stereoisomers:

Kovats' RI, non-polar column, custom temperature program

Column type | Active phase | I | Reference | Comment |
---|---|---|---|---|
Capillary | ZB-1 | 2882. | Ebner, Corol, et al., 2006 | 30. m/0.25 mm/0.25 μm, He; Program: 70C(5min) => 20C/min => 220C(0.33min) => 5C/min => 315C (4min) |

References

Ebner, Corol, et al., 2006
Ebner, M.J.; Corol, D.I.; Havlíková, H.; Honour, J.W.; Fry, J.P.,
Identification of neuroactive steroids and their precursors and metabolites in adult male rat brain,
Endocrinology, 2006, 147, 1, 179-190, https://doi.org/10.1210/en.2005-1065
. [all data]