Phygrine

Kovats' RI, non-polar column, temperature ramp

View large format table.

Column type Active phase I Reference Comment
CapillaryDB-12043.Jenett-Siems, Weigl, et al., 2005He, 6. K/min; Column length: 30. m; Column diameter: 0.32 mm; Tstart: 70. C; Tend: 300. C

Normal alkane RI, non-polar column, custom temperature program

View large format table.

Column type Active phase I Reference Comment
CapillaryOV-12045.Ei-Shazly and Wink M., 200815. m/0.317 mm/0.25 μm, He; Program: 100 0C (2 min) 15 0C/min -> 250 0C 25 0C/min -> 300 0C (5 min)

References

Jenett-Siems, Weigl, et al., 2005
Jenett-Siems, K.; Weigl, R.; Böhm, A.; Mann, P.; Tofern-Reblin, B.; Ott, S.C.; Ghomian, A.; Kaloga, M.; Siems, K.; Witte, L.; Hilker, M.; Müller, F.; Eich, E., Chemotaxonomy of the pantropical genus Merremia (Convolvulaceae) based on the distribution of tropane alkaloids, Phytochemistry, 2005, 66, 12, 1448-1464, https://doi.org/10.1016/j.phytochem.2005.04.027 . [all data]

Ei-Shazly and Wink M., 2008
Ei-Shazly, A.; Wink M., Tropane and pyrrolidine alkaloids from Convolvulus lanatus Vahl, Z. Naturforsch. C:, 2008, 63, 5-6, 321-325. [all data]