tri-ethoxylated trimethylol propane triacrylate (Acrylic acid 2-[2-(2-acryloyloxy-ethoxy)-ethoxymethyl]-2-(2-acryloyloxy-ethoxymethyl)-butyl ester)
- Formula: C21H32O9
- Molecular weight: 428.4734
- IUPAC Standard InChIKey: MTPIZGPBYCHTGQ-UHFFFAOYSA-N
- Chemical structure:
View 3d structure (requires JavaScript / HTML 5) - Permanent link for this species. Use this link for bookmarking this species for future reference.

Van Den Dool and Kratz RI, non-polar column, temperature ramp

Column type | Active phase | I | Reference | Comment |
---|---|---|---|---|
Capillary | MDN-5 | 2592. | Yoo, Pace, et al., 2004 | 30. m/0.32 mm/0.25 μm, He, 50. C @ 3. min, 10. K/min, 320. C @ 10. min |

References

Yoo, Pace, et al., 2004
Yoo, S.J.; Pace, G.V.; Khoo, B.K.; Lech, J.; Hartman, T.G.,
Mass Spectrometry and Gas Chromatographic Retention Indices of Selected UV/EB-Curable Monomers and Photoinitiators Commonly Used in Food Packaging Print and Coating Formulations, Radtech Report, Radtech Report; Technical Paper, 2004, 8. [all data]