1,2,4a,5,8,8a-Hexahydro-4,7-dimethyl-1-(1-methylethyl) naphthalene

Kovats' RI, non-polar column, custom temperature program

View large format table.

Column type Active phase I Reference Comment
CapillarySPB-11524.Riu-Aumatell, Castellari, et al., 200430. m/0.25 mm/0.25 μm; Program: not specified

Kovats' RI, polar column, temperature ramp

View large format table.

Column type Active phase I Reference Comment
CapillarySupelcowax1761.Riu-Aumatell, Castellari, et al., 200430. m/0.25 mm/0.25 μm, 60. C @ 5. min, 3. K/min, 240. C @ 10. min

References

Riu-Aumatell, Castellari, et al., 2004
Riu-Aumatell, M.; Castellari, M.; López-Tamames, E.; Galassi, S.; Buxaderas, S., Characterisation of volatile compounds of fruit juices and nectars by HS/SPME and GC/MS, Food Chem., 2004, 87, 4, 627-637, https://doi.org/10.1016/j.foodchem.2003.12.033 . [all data]