Butanamide, N-isopropyl

Kovats' RI, non-polar column, isothermal

View large format table.

Column type Active phase Temperature (C) I Reference Comment
PackedSE-30180.1042.Krawczyk and Piotrowski, 1989N2, Chromosorb W AW; Column length: 1. m

References

Krawczyk and Piotrowski, 1989
Krawczyk, W.; Piotrowski, G.T., Relationships Between Structure and Retention Index for N-Substituted Amides of Aliphatic Acids on a Non-Polar Column, J. Chromatogr., 1989, 463, 297-304, https://doi.org/10.1016/S0021-9673(01)84484-8 . [all data]