Benzene, (1,2-dichloro-1,2,2-trifluoroethyl)-4-(fluorosulfonyl)

Normal alkane RI, non-polar column, temperature ramp

View large format table.

Column type Active phase I Reference Comment
Capillary5 % Phenyl silicone1381.Tiers, 200220. K/min; Tstart: 40. C

References

Tiers, 2002
Tiers, G.vD., Perhaloethyl aromatic compounds and perhaloethenyl aromatic compounds therefrom (United States Patent 6350925), 2002, 7. [all data]