d3-morphine, di-TMS

Normal alkane RI, non-polar column, temperature ramp

View large format table.

Column type Active phase I Reference Comment
CapillaryUltra-12520.Sticht and Käferstein, 200012. m/0.2 mm/0.33 μm, He, 5. K/min; Tstart: 200. C; Tend: 250. C

References

Sticht and Käferstein, 2000
Sticht, G.; Käferstein, H., Detection of psilocin in body fluids, Forensic Sci. Int., 2000, 113, 1-3, 403-407, https://doi.org/10.1016/S0379-0738(00)00213-9 . [all data]