2-hexyl-4,5-dimethyl-3-thiazoline, trans
- Formula: C11H21NS
- Molecular weight: 199.356
- IUPAC Standard InChIKey: VSQACYCOENQFJB-QWRGUYRKSA-N
- Chemical structure:
View 3d structure (requires JavaScript / HTML 5) - Stereoisomers:
- Other names: 4,5-dimethyl-2-hexyl-3-thiazoline, trans

Van Den Dool and Kratz RI, non-polar column, temperature ramp

Column type | Active phase | I | Reference | Comment |
---|---|---|---|---|
Capillary | BPX-5 | 1518. | Elmore and Mottram, 1997 | 50. m/0.32 mm/0.5 μm, He, 60. C @ 2. min, 10. K/min; Tend: 280. C |

Van Den Dool and Kratz RI, non-polar column, custom temperature program

Column type | Active phase | I | Reference | Comment |
---|---|---|---|---|
Capillary | BPX-5 | 1512. | Elmore, Mottram, et al., 1997 | 50. m/0.32 mm/0.5 μm, He; Program: 0C (10min) => 40C/min => 40C (2min) => 4C/min => 280C |

Van Den Dool and Kratz RI, polar column, custom temperature program

Column type | Active phase | I | Reference | Comment |
---|---|---|---|---|
Capillary | BP-20 | 1896. | Elmore, Mottram, et al., 1997 | 50. m/0.32 mm/0.5 μm, He; Program: 0C (10min) => 40C/min => 40C (2min) => 4C/min => 250C |

References

Elmore and Mottram, 1997
Elmore, J.S.; Mottram, D.S.,
Investigation of the reaction between ammonium sulfide, aldehydes, and α-dicarbonyls to form some lipid-Maillard interaction products found in cooked beef,
J. Agric. Food Chem., 1997, 45, 9, 3595-3602, https://doi.org/10.1021/jf970065u
. [all data]
Elmore, Mottram, et al., 1997
Elmore, J.S.; Mottram, D.S.; Enser, M.; Wood, J.D.,
Novel thiazoles and 3-thiazolines in cooked beef aroma,
J. Agric. Food Chem., 1997, 45, 9, 3603-3607, https://doi.org/10.1021/jf970066m
. [all data]