Megastigma-6(E),8(E)-dien-4-one

Normal alkane RI, non-polar column, temperature ramp

View large format table.

Column type Active phase I Reference Comment
CapillaryDB-51521.Winterhalter, Herderich, et al., 199030. m/0.259 mm/0.25 μm, He, 60. C @ 2.5 min, 2.5 K/min; Tend: 200. C

References

Winterhalter, Herderich, et al., 1990
Winterhalter, P.; Herderich, M.; Schreier, P., 4-Hydroxy-7,8-dihydro-β-ionone and Isomeric Megastigma-6,8-dien-4-ones: New C13 Norisoprenoids in Quince (Cydonia oblonga, Mill.) Fruit, J. Agric. Food Chem., 1990, 38, 3, 796-799, https://doi.org/10.1021/jf00093a043 . [all data]