(E)-2-Octadecenal

Kovats' RI, non-polar column, isothermal

View large format table.

Column type Active phase Temperature (C) I Reference Comment
PackedOV-1200.2082.Yamaoka, Shiraishi, et al., 1985He, Chromosorb W AW DMCS (80-100 mesh); Column length: 3. m

Kovats' RI, polar column, isothermal

View large format table.

Column type Active phase Temperature (C) I Reference Comment
PackedPEG 20M200.2450.Yamaoka, Shiraishi, et al., 1985He, Chromosorb W AW DMCS (80-100 mesh); Column length: 3. m

References

Yamaoka, Shiraishi, et al., 1985
Yamaoka, R.; Shiraishi, Y.; Ueno, T.; Kuwahara Y.; Fukami, H., Structure elucidation of koiganal I and II, the sex pheromones of the webbing clothes moth, using capillary GC/MS, Mass Spectroscopy, 1985, 33, 3, 189-195. [all data]