Oxazole, 4-methyl-2-propyl

Kovats' RI, non-polar column, isothermal

View large format table.

Column type Active phase Temperature (C) I Reference Comment
CapillaryOV-101110.901.Zhuravleva, Shenderyuk, et al., 199050. m/0.30 mm/0.40 μm, He
CapillaryOV-101110.901.Golovnya, Shenderyuk, et al., 198940. m/0.28 mm/0.40 μm, He

Kovats' RI, polar column, isothermal

View large format table.

Column type Active phase Temperature (C) I Reference Comment
CapillaryPEG-40M110.1229.Golovnya, Shenderyuk, et al., 1991He; Column length: 50. m; Column diameter: 0.30 mm
CapillaryPEG-40M110.1229.Zhuravleva, Shenderyuk, et al., 199050. m/0.30 mm/0.40 μm, He
CapillaryPEG-40M110.1229.Golovnya, Shenderyuk, et al., 198947. m/0.30 mm/0.40 μm, He

References

Zhuravleva, Shenderyuk, et al., 1990
Zhuravleva, I.L.; Shenderyuk, V.V.; Yakush, E.V.; Golovnya, R.V., Calculation of retention indexes of alkyloxazoles and alkylthiazoles in capillary chromatography, Bull. Acad. Sci. USSR, Div. Chem. Sci. (Engl. Transl.), 1990, 6, 6, 1204-1210, https://doi.org/10.1007/BF00962384 . [all data]

Golovnya, Shenderyuk, et al., 1989
Golovnya, R.V.; Shenderyuk, V.V.; Zhuravleva, I.L.; Yakush, E.V., Use of a principle of non-additivity of sorption energies for calculation of retention indices of alkyloxazoles in capillary chromatography, Zh. Anal. Khim., 1989, 44, 2037-2042. [all data]

Golovnya, Shenderyuk, et al., 1991
Golovnya, R.V.; Shenderyuk, V.V.; Zhuravleva, I.L.; Yakush, E.V., Analogy of sorption properties of alkylthiazoles and alkyl-oxazoles and its use for the calculation of retention indexes in capillary gas chromatography, Zh. Anal. Khim., 1991, 46, 2, 313-319. [all data]