2,5-Dimethoxy-4-methyl-β-phenethylamine-M (O-desmethyl-desamino-COOH-), methyl-acetylated, I

Kovats' RI, non-polar column, temperature ramp

View large format table.

Column type Active phase I Reference Comment
CapillaryHP-11860.Theobald and Maurer, 200612. m/0.2 mm/0.33 μm, He, 100. C @ 3. min, 30. K/min, 310. C @ 8. min

References

Theobald and Maurer, 2006
Theobald, D.S.; Maurer, H.H., Studies on the metabolism and toxicological detection of the designer drug 2,5-dimethoxy-4-methyl-β-phenethylamine (2C-D) in rat urine using gas chromatographic/mass spectrometric techniques, J. Mass Spectrom., 2006, 41, 11, 1509-1519, https://doi.org/10.1002/jms.1128 . [all data]