Pyrazine, 2-(3-methylpentyl)-3-methoxy
- Formula: C11H18N2O
- Molecular weight: 194.2734
- IUPAC Standard InChIKey: XCGYYKCDQJOWDP-UHFFFAOYSA-N
- Chemical structure:
View 3d structure (requires JavaScript / HTML 5) - Permanent link for this species. Use this link for bookmarking this species for future reference.

Normal alkane RI, non-polar column, temperature ramp

Column type | Active phase | I | Reference | Comment |
---|---|---|---|---|
Capillary | OV-101 | 1351. | Mihara and Masuda, 1988 | 2. K/min; Column length: 50. m; Column diameter: 0.22 mm; Tstart: 80. C; Tend: 200. C |

References

Mihara and Masuda, 1988
Mihara, S.; Masuda, H.,
Structure-odor relationships for disubstituted pyrazines,
J. Agric. Food Chem., 1988, 36, 6, 1242-1247, https://doi.org/10.1021/jf00084a029
. [all data]