3-(Hydroxyacetoxy)-tropane

Kovats' RI, non-polar column, temperature ramp

View large format table.

Column type Active phase I Reference Comment
CapillaryHP-5MS1420.Doncheva, Berkov, et al., 200630. m/0.25 mm/0.25 μm, He, 4. K/min, 300. C @ 10. min; Tstart: 50. C

References

Doncheva, Berkov, et al., 2006
Doncheva, T.; Berkov, S.; Philipov, S., Comparative study of the alkaloids in tribe Datureae and their chemosystematic significance, Biochem. Syst. Ecol., 2006, 34, 6, 478-488, https://doi.org/10.1016/j.bse.2006.01.008 . [all data]