17β(H),21β(H)-Trishomohopanoic acid methyl ester

Kovats' RI, non-polar column, isothermal

View large format table.

Column type Active phase Temperature (C) I Reference Comment
CapillaryCP Sil 5 CB300.3941.Yamamoto, Naraoka, et al., 200560. m/0.25 mm/0.25 μm

References

Yamamoto, Naraoka, et al., 2005
Yamamoto, M.; Naraoka, H.; Ishiwatari, R.; Ogihara, S., Carbon isotope signatures of bacterial 28-norhopanoic acids in Miocene-Pliocene diatomaceous and phosphatic sediments, Chem. Geol., 2005, 218, 1-2, 117-133, https://doi.org/10.1016/j.chemgeo.2005.01.027 . [all data]