Benzoic acid, 2-hydroxy-4,6-dimethyl, DTBS
- Formula: C17H26O3Si
- Molecular weight: 306.4720
- IUPAC Standard InChIKey: DQOUYPLOHNAWOJ-UHFFFAOYSA-N
- Chemical structure:
View 3d structure (requires JavaScript / HTML 5) - Permanent link for this species. Use this link for bookmarking this species for future reference.

Kovats' RI, non-polar column, custom temperature program

Column type | Active phase | I | Reference | Comment |
---|---|---|---|---|
Packed | OV-1 | 1890. | Brooks and Cole, 1988 | N2, Gas-Chrom Q (100-120 mesh); Column length: 1.8 m; Program: not specified |

References

Brooks and Cole, 1988
Brooks, C.J.W.; Cole, W.J.,
Cyclic Di-tert.-butylsilylene derivatives of substituted salicylic acids and related compounds. A study by gas chromatography-mass spectrometry,
J. Chromatogr., 1988, 441, 1, 13-29, https://doi.org/10.1016/S0021-9673(01)84651-3
. [all data]