3,13-dimethyl-tricosane

Normal alkane RI, non-polar column, temperature ramp

Data compiled by: NIST Mass Spectrometry Data Center, William E. Wallace, director

Column type Capillary
Active phase HP-1
Column length (m) 30.
Carrier gas Helium
Substrate
Column diameter (mm) 0.20
Phase thickness (μm)
Tstart (C) 150.
Tend (C) 320.
Heat rate (K/min) 3.
Initial hold (min)
Final hold (min) 20.
I 2410.
ReferenceHaverty, Page, et al., 1991
Comment MSDC-RI

Van Den Dool and Kratz RI, non-polar column, temperature ramp

Data compiled by: NIST Mass Spectrometry Data Center, William E. Wallace, director

Column type Capillary
Active phase DB-5MS
Column length (m) 30.
Carrier gas He
Substrate
Column diameter (mm) 0.32
Phase thickness (μm) 0.25
Tstart (C) 150.
Tend (C) 280.
Heat rate (K/min) 3.
Initial hold (min)
Final hold (min)
I 2405.
ReferenceSteinmetz, Schmolz, et al., 2003
Comment MSDC-RI

References

Haverty, Page, et al., 1991
Haverty, M.I.; Page, M.; Thorne, B.L.; Escoubas, P., Cuticular hydrocarbons: species and population-level discrimination in termites, USDA Forest Service Gen. Tech. Report PSW-128, The Forest Service, U.S.Department of Agriculture, 1991, 52. [all data]