1-Propanol, 1-phenyl-2-(1-pyrrolidinyl), TMS, erythro

Kovats' RI, non-polar column, temperature ramp

View large format table.

Column type Active phase I Reference Comment
CapillaryHP-11665.Springer, Fritschi, et al., 200312. m/0.20 mm/0.33 μm, He, 100. C @ 3. min, 30. K/min, 310. C @ 8. min

References

Springer, Fritschi, et al., 2003
Springer, D.; Fritschi, G.; Maurer, H.H., Metabolism of the new designer drug α-pyrrolidinopropiophenone (PPP) and the toxicological detection of PPP and 4'-methyl-α-pyrrolidinopropiophenone (MPPP) studied in rat urine using gas chromatography-mass spectrometry, J. Chromatogr. B, 2003, 796, 2, 253-266, https://doi.org/10.1016/j.jchromb.2003.07.008 . [all data]