S-Isobutyl, S-2-(diethylamino)ethyl methyldithiophosphonate

Normal alkane RI, non-polar column, custom temperature program

View large format table.

Column type Active phase I Reference Comment
CapillaryDB-51782.Saveljeva, Zenkevich, et al., 2003He; Program: not specified

References

Saveljeva, Zenkevich, et al., 2003
Saveljeva, E.; Zenkevich, I.; Radilov, A., Identification of chemical neutralization and products of organophosphorus chemical warfare agents, 2003, retrieved from http://www.shimadzu.com/apps/form.cfm. [all data]