Cadinan-3-β,10-β-diol

Van Den Dool and Kratz RI, non-polar column, temperature ramp

View large format table.

Column type Active phase I Reference Comment
CapillaryDB-51740.Queiroga, Ferracini, et al., 199630. m/0.25 mm/0.25 μm, H2, 2. K/min; Tstart: 105. C; Tend: 280. C

References

Queiroga, Ferracini, et al., 1996
Queiroga, C.L.; Ferracini, V.L.; Marsaioli, A.J., Three new oxygenated cadinanes from Baccharis species, Phytochemistry, 1996, 42, 4, 1097-1103, https://doi.org/10.1016/0031-9422(95)00977-9 . [all data]