2-Heptadecylidene-1,3-dithiolane
- Formula: C20H38S2
- Molecular weight: 342.646
- IUPAC Standard InChIKey: GWQMQVPESVIDPM-UHFFFAOYSA-N
- Chemical structure:
View 3d structure (requires JavaScript / HTML 5) - Permanent link for this species. Use this link for bookmarking this species for future reference.

Normal alkane RI, non-polar column, temperature ramp

Column type | Active phase | I | Reference | Comment |
---|---|---|---|---|
Capillary | DB-1 | 2687. | Dudda and Spiteller, 1996 | 30. m/0.32 mm/0.1 μm, H2, 3. K/min; Tstart: 80. C; Tend: 280. C |

References

Dudda and Spiteller, 1996
Dudda, A.; Spiteller, G.,
Structure and origin of artifacts in the analysis of plasmalogens,
J. Mass Spectrom., 1996, 31, 3, 303-308, https://doi.org/10.1002/(SICI)1096-9888(199603)31:3<303::AID-JMS304>3.0.CO;2-5
. [all data]