3-Isobutyl-2-methoxy-6-methylpyrazine

Normal alkane RI, non-polar column, temperature ramp

View large format table.

Column type Active phase I Reference Comment
CapillaryDB-51239.Gallois and Grimont, 1985H2, 2. K/min; Column length: 60. m; Column diameter: 0.32 mm; Tstart: 40. C; Tend: 200. C

References

Gallois and Grimont, 1985
Gallois, A.; Grimont, P.A.D., Pyrazines responsible for the potatolike odor produced by some Serratia and Cedecea strains, Appl. Environ. Microbiol., 1985, 10, 1048-1051. [all data]