(E)-2-Pentylnon-2-enal
- Formula: C14H26O
- Molecular weight: 210.3556
- IUPAC Standard InChIKey: VIKQYIINCNAGJW-WYMLVPIESA-N
- Chemical structure:
View 3d structure (requires JavaScript / HTML 5) - Stereoisomers:

Normal alkane RI, non-polar column, custom temperature program

Column type | Active phase | I | Reference | Comment |
---|---|---|---|---|
Capillary | PONA | 1570. | Robert, Héritier, et al., 2004 | 50. m/0.2 mm/0.5 μm, He; Program: 60C(0.5min => 70C/min => 60C => 4C/min => 240C |

Normal alkane RI, polar column, custom temperature program

Column type | Active phase | I | Reference | Comment |
---|---|---|---|---|
Capillary | DB-Wax | 1900. | Robert, Héritier, et al., 2004 | 60. m/0.25 mm/0.2 μm, He; Program: 60C(0.5min => 70C/min => 60C => 4C/min => 240C |

References

Robert, Héritier, et al., 2004
Robert, F.; Héritier, J.; Quiquerez, J.; Simian, H.; Blank, I.,
Synthesis and sensorial properties of 2-alkylalk-2-enals and 3-(acetylthio)-2-alkyl alkanals,
J. Agric. Food Chem., 2004, 52, 11, 3525-3529, https://doi.org/10.1021/jf0498968
. [all data]