Dihydrocamphene carbinol

Kovats' RI, non-polar column, custom temperature program

View large format table.

Column type Active phase I Reference Comment
CapillaryDB-5MS1210.Radulescu, Chiliment, et al., 200430. m/0.32 mm/0.25 μm, He; Program: 40C (3min) => 5C/min => 160C (2min) => 10C/min => 280C (10min)

References

Radulescu, Chiliment, et al., 2004
Radulescu, V.; Chiliment, S.; Oprea, E., Capillary gas chromatography-mass spectrometry of volatile and semi-volatile compounds of Salvia officinalis, J. Chromatogr. A, 2004, 1027, 1-2, 121-126, https://doi.org/10.1016/j.chroma.2003.11.046 . [all data]