Spermidine, tris-MOC derivative

Normal alkane RI, non-polar column, temperature ramp

View large format table.

Column type Active phase I Reference Comment
CapillaryDB-12365.Harms, 20026. K/min; Column length: 30. m; Column diameter: 0.32 mm; Tstart: 150. C; Tend: 300. C

References

Harms, 2002
Harms, R., Eigenschaften rekombinanter sym-Homospermidinsynthase und Desoxyhypusinsynthase aus Senecio vernalis, Dissertation, Technischen Universitat Carolo-Wilhelmina, Braunschweig, 2002, 139. [all data]