phyta-trans-3,trans-5-diene

Normal alkane RI, polar column, temperature ramp

View large format table.

Column type Active phase I Reference Comment
CapillaryEC-10001880.Bendall, 200130. m/0.25 mm/0.25 μm, He, 35. C @ 5. min, 5. K/min, 230. C @ 15. min

References

Bendall, 2001
Bendall, J.G., Aroma compounds of fresh milk from New Zealand cows fed different diets, J. Agric. Food Chem., 2001, 49, 10, 4825-4832, https://doi.org/10.1021/jf010334n . [all data]