7,7-dimethyl-2-methoxy-norborn-2-ene

Normal alkane RI, polar column, temperature ramp

View large format table.

Column type Active phase I Reference Comment
CapillarySupelcowax-101213.Korány, Mednyánszky, et al., 200060. m/0.25 mm/0.25 μm, He, 4. K/min; Tstart: 60. C; Tend: 280. C

References

Korány, Mednyánszky, et al., 2000
Korány, K.; Mednyánszky, Zs.; Amtmann, M., Preliminary results of a recognition method visualizing the aroma and fragrance features, Acta Aliment., 2000, 29, 2, 187-198, https://doi.org/10.1556/AAlim.29.2000.2.9 . [all data]