γ-Guaiene

Normal alkane RI, polar column, temperature ramp

Data compiled by: NIST Mass Spectrometry Data Center, William E. Wallace, director

Column type Capillary
Active phase DB-Wax
Column length (m) 60.
Carrier gas He
Substrate
Column diameter (mm) 0.25
Phase thickness (μm) 0.25
Tstart (C) 60.
Tend (C) 180.
Heat rate (K/min) 3.
Initial hold (min) 8.
Final hold (min) 80.
I 1761.
ReferenceWei A. and Shibamoto T., 2007
Comment MSDC-RI

References

Wei A. and Shibamoto T., 2007
Wei A.; Shibamoto T., Antioxidant activities and volatile constituents of various essential oils, J. Agric. Food Chem., 2007, 55, 5, 1737-1742, https://doi.org/10.1021/jf062959x . [all data]