Androsta-1,4-dien-6β-ol-3,17-dione,tris-TMS
- Formula: C28H48O3Si3
- Molecular weight: 516.9354
- IUPAC Standard InChIKey: JNXWIUXKBXITAT-FJXIBAFOSA-N
- Chemical structure:

Normal alkane RI, non-polar column, temperature ramp

Column type | Active phase | I | Reference | Comment |
---|---|---|---|---|
Capillary | SE-54 | 2820. | Schänzer and Donike, 1992 | 15. m/0.2 mm/0.33 μm, He, 5. K/min; Tstart: 200. C; Tend: 300. C |

References

Schänzer and Donike, 1992
Schänzer, W.; Donike, M.,
Metabolism of boldenone in man: gas chromatographic/mass spectrometric identification of urinary excreted metabolites and determination of excretion rates,
Biol. Mass Spectrom., 1992, 21, 1, 3-16, https://doi.org/10.1002/bms.1200210104
. [all data]