2-(2-furyl)-1-pyrroline

Normal alkane RI, polar column, temperature ramp

View large format table.

Column type Active phase I Reference Comment
CapillaryCarbowax 20M1780.Helak, Kersten, et al., 19892. K/min; Column length: 50. m; Column diameter: 0.32 mm; Tstart: 70. C; Tend: 180. C

References

Helak, Kersten, et al., 1989
Helak, B.; Kersten, E.; Spengler, K.; Tressl, R.; Rewicki, D., Formation of furylpyrrolidines and -piperidines on heating L-proline with reducing sugars and furancarboxaldehydes, J. Agric. Food Chem., 1989, 37, 2, 405-410, https://doi.org/10.1021/jf00086a029 . [all data]