5-Chloroheptanoic acid, methyl ester
- Formula: C8H15ClO2
- Molecular weight: 178.656
- IUPAC Standard InChIKey: DOGZPPRWSGHQHF-UHFFFAOYSA-N
- Chemical structure:
View 3d structure (requires JavaScript / HTML 5) - Permanent link for this species. Use this link for bookmarking this species for future reference.

Kovats' RI, non-polar column, isothermal

Column type | Active phase | Temperature (C) | I | Reference | Comment |
---|---|---|---|---|---|
Capillary | SE-30 | 100. | 1196. | Haken and Korhonen, 1984 | N2; Column length: 25. m; Column diameter: 0.22 mm |
Capillary | SE-30 | 120. | 1191. | Haken and Korhonen, 1984 | N2; Column length: 25. m; Column diameter: 0.22 mm |

Kovats' RI, polar column, isothermal

Column type | Active phase | Temperature (C) | I | Reference | Comment |
---|---|---|---|---|---|
Capillary | Carbowax 20M | 100. | 1657. | Haken and Korhonen, 1984 | N2; Column length: 22. m; Column diameter: 0.3 mm |
Capillary | Carbowax 20M | 120. | 1702. | Haken and Korhonen, 1984 | N2; Column length: 22. m; Column diameter: 0.3 mm |

References

Haken and Korhonen, 1984
Haken, J.K.; Korhonen, I.O.O.,
Gas chromatography of homologous esters. XXV. Capillary column studies of monochlorinated C5-C18 n-carboxylic esters,
J. Chromatogr., 1984, 298, 89-100, https://doi.org/10.1016/S0021-9673(01)92697-4
. [all data]