13-TigloyIoxylupanine

Normal alkane RI, non-polar column, temperature ramp

View large format table.

Column type Active phase I Reference Comment
CapillarySE-302750.Wink, Witte, et al., 1983He, 6. K/min; Column length: 15. m; Column diameter: 0.26 mm; Tstart: 150. C; Tend: 270. C

References

Wink, Witte, et al., 1983
Wink, M.; Witte, L.; Hartmann, T.; Theuring, C.; Volz. V., Accumulation of quinolizidine alkaloids in plants and cell suspension cultures: genera lupinus, cytisus, baptisia, genista, laburnum, and sophora, Planta Medica, 1983, 48, 4, 253-257, https://doi.org/10.1055/s-2007-969928 . [all data]