5α-Dihydrotestosterone, TFA

Kovats' RI, non-polar column, isothermal

View large format table.

Column type Active phase Temperature (C) I Reference Comment
PackedOV-1225.2452.Voelter, Jung, et al., 1971N2, GasChrom Q

References

Voelter, Jung, et al., 1971
Voelter, W.; Jung, G.; Breitmaier, E.; Bouchon, G.; Bayer, E.; Gupta, D., Comparison of the trifluoroacetyl and trimethylsilylether derivaties for gas chromatography of steroids, Anal. Chim. Acta., 1971, 53, 1, 185-188, https://doi.org/10.1016/S0003-2670(01)80085-4 . [all data]