Dihydro-2(3H)-thiophenthione

Normal alkane RI, polar column, temperature ramp

View large format table.

Column type Active phase I Reference Comment
CapillaryDB-Wax1720.Chyau and Mau, 199960. m/0.25 mm/0.25 μm, N2, 3. K/min; Tstart: 40. C; Tend: 210. C

References

Chyau and Mau, 1999
Chyau, C.-C.; Mau, J.-L., Release of volatile compounds from microwave heating of garlic juice with 2,4-decadienals, Food Chem., 1999, 64, 4, 531-535, https://doi.org/10.1016/S0308-8146(98)00162-9 . [all data]