Benzene, (1-ethyl-1-propenyl)-, cis

Kovats' RI, non-polar column, isothermal

View large format table.

Column type Active phase Temperature (C) I Reference Comment
CapillaryOV-101100.1088.Engewald, Topalova, et al., 1987Column length: 50. m; Column diameter: 0.30 mm

Normal alkane RI, non-polar column, temperature ramp

View large format table.

Column type Active phase I Reference Comment
CapillaryOV-1011171.Zenkevich, 2001N2, 4. K/min; Column length: 25. m; Column diameter: 0.20 mm; Tstart: 60. C; Tend: 240. C

References

Engewald, Topalova, et al., 1987
Engewald, W.; Topalova, I.; Petsev, N.; Dimitrov, Chr., Structure-Retention Correlations of Hydrocarbons in GLC and GSC. Alkenylbenzenes, Chromatographia, 1987, 23, 8, 561-565, https://doi.org/10.1007/BF02324864 . [all data]

Zenkevich, 2001
Zenkevich, I.G., Interpretation of Gas Chromatographic Retention Indices in estimation of Structures of Isomeric Products of Radical Chlorinating of Alkyl Arenes, Zh. Org. Khim., 2001, 37, 2, 283-293. [all data]