Bufotenin, monoTMS
- Formula: C15H24N2OSi
- Molecular weight: 276.4494
- IUPAC Standard InChIKey: XXUYWQAQGMCDRE-UHFFFAOYSA-N
- Chemical structure:
View 3d structure (requires JavaScript / HTML 5) - Permanent link for this species. Use this link for bookmarking this species for future reference.

Normal alkane RI, non-polar column, temperature ramp

Column type | Active phase | I | Reference | Comment |
---|---|---|---|---|
Packed | SE-30 | 2090. | Narasimhachari, Spaide, et al., 1971 | Column length: 2. m; Tstart: 140. C |

References

Narasimhachari, Spaide, et al., 1971
Narasimhachari, N.; Spaide, J.; Heller, B.,
Gas liquid chromatographic and mass spectrometric studies on trimethylsilyl derivatives of N-methyl- and N,N-dimethyltryptamines,
J. Chromatogr. Sci., 1971, 9, 8, 502-505, https://doi.org/10.1093/chromsci/9.8.502
. [all data]