(1-Methylheptyl)succinic acid, methyl ester

Normal alkane RI, non-polar column, temperature ramp

View large format table.

Column type Active phase I Reference Comment
CapillaryBPX-51664.Wilkes, Kühner, et al., 200350. m/0.22 mm/0.25 μm, He, 60. C @ 8. min, 3. K/min; Tend: 340. C
CapillaryBPX-51666.Wilkes, Kühner, et al., 200350. m/0.22 mm/0.25 μm, He, 60. C @ 8. min, 3. K/min; Tend: 340. C

References

Wilkes, Kühner, et al., 2003
Wilkes, H.; Kühner, S.; Bolm, C.; Fischer, T.; Classen, A.; Widdel, F.; Rabus, R., Formation of n-alkane- and cycloalkane-derived organic acids during anaerobic growth of a denitrifying bacterium with crude oil, Org. Geochem., 2003, 34, 9, 1313-1323, https://doi.org/10.1016/S0146-6380(03)00099-8 . [all data]