Elema-1,3-dien-7-ol

Van Den Dool and Kratz RI, non-polar column, custom temperature program

View large format table.

Column type Active phase I Reference Comment
CapillaryCP Sil 5 CB1531.Paul, König, et al., 2001Column length: 25. m; Program: not specified

References

Paul, König, et al., 2001
Paul, C.; König, W.A.; Wu, C.-L., Sesquiterpenoid constituents of the liverworts Lepidozia fauriana and Lepidozia vitrea, Phytochemistry, 2001, 58, 5, 789-798, https://doi.org/10.1016/S0031-9422(01)00322-3 . [all data]