3,7-dimethyl-hentriacontane

Van Den Dool and Kratz RI, non-polar column, temperature ramp

Data compiled by: NIST Mass Spectrometry Data Center, William E. Wallace, director

Column type CapillaryCapillaryCapillary
Active phase DB-5MSHT-5HT-5
Column length (m) 30.25.25.
Carrier gas HeN2N2
Substrate
Column diameter (mm) 0.320.530.53
Phase thickness (μm) 0.250.220.22
Tstart (C) 150.150.150.
Tend (C) 300.320.320.
Heat rate (K/min) 2.15.15.
Initial hold (min)
Final hold (min)  20.20.
I 3209.3208.3203.
ReferenceSteiner, Steidle, et al., 2005Goh S.H., Ooi K.E., et al., 1993Goh S.H., Ooi K.E., et al., 1993
Comment MSDC-RI MSDC-RI MSDC-RI

References

Steiner, Steidle, et al., 2005
Steiner, S.; Steidle, J.L.M.; Ruther, J., Female sex pheromone in immature insect males - a case of pre-emergence chemical mimicry?, Behavioral Ecology and Sociobiology, 2005, 58, 2, 111-120, https://doi.org/10.1007/s00265-005-0930-x . [all data]

Goh S.H., Ooi K.E., et al., 1993
Goh S.H.; Ooi K.E.; Chuah C.H.; Yong H.S.; Khoo S.G.; Ong S.H., Cuticular hydrocarbons from two species of Malaysian Bactrocera fruit flies, Biochem. Syst. Ecol., 1993, 21, 2, 215-226, https://doi.org/10.1016/0305-1978(93)90039-T . [all data]