ornithine, trifluoroacetyl-isopropyl ester

Normal alkane RI, non-polar column, temperature ramp

View large format table.

Column type Active phase I Reference Comment
CapillarySE-541603.Dallakian and Budzikiewicz, 199725. m/0.25 mm/0.25 μm, He, 30. C @ 6. min, 10. K/min, 250. C @ 2. min

References

Dallakian and Budzikiewicz, 1997
Dallakian, P.; Budzikiewicz, H., Gas chromatography - chemical ionization mass spectrometry in amino acid analysis of pyoverdins, J. Chromatogr. A, 1997, 787, 1-2, 195-203, https://doi.org/10.1016/S0021-9673(97)00641-9 . [all data]