17β,21β(H)-30-norhopane

Normal alkane RI, non-polar column, custom temperature program

Data compiled by: NIST Mass Spectrometry Data Center, William E. Wallace, director

Column type CapillaryCapillary
Active phase DB-5CP Sil 5 CB
Column length (m) 30.25.
Carrier gas HeliumHe
Substrate
Column diameter (mm) 0.250.32
Phase thickness (μm)  0.2
Program not specified50C => 20C/min => 130C => 4C/min => 300C (20min)
I 3000.3045.
ReferenceYoneyama, Yamazaki, et al., 1996Kenig, Sinninghe Damsté, et al., 1995
Comment MSDC-RI MSDC-RI

References

Yoneyama, Yamazaki, et al., 1996
Yoneyama, Y.; Yamazaki, M.; Yada, F.; Kita, O.; Yoshimoto, S.; Kato, T., Analyses of the Solvent-Soluble Products of Yubari and Taiheiyo Coals Treated with Zink and Butyl Iodide under Mild Conditions - Analyses of Saturate Fractions -, J. Japan Institute of Energy, 1996, 75, 1, 35-41, https://doi.org/10.3775/jie.75.35 . [all data]

Kenig, Sinninghe Damsté, et al., 1995
Kenig, F.; Sinninghe Damsté, J.S.; Kock-van Dalen, A.C.; Rijpstra, W.I.C.; Huc, A.Y.; de Leeuw, J.W., Occurrence and origin of mono-, di-, and trimethylalkanes in modern and holocene cyanobacterial mats from Abu Dhabi, United Arab Emirates, Geochim. Cosmochim. Acta, 1995, 59, 14, 2999-3015, https://doi.org/10.1016/0016-7037(95)00190-5 . [all data]