Dihydrolusitanine

Normal alkane RI, non-polar column, temperature ramp

View large format table.

Column type Active phase I Reference Comment
CapillaryDB-11780.Greinwald, Bachmann, et al., 1995He, 6. K/min; Column length: 30. m; Column diameter: 0.32 mm; Tstart: 150. C; Tend: 300. C

References

Greinwald, Bachmann, et al., 1995
Greinwald, R.; Bachmann, P.; Lewis, G.; Witte, L.; Czygan, F.-C., Alkaloids of the genus Poecilanthe (Leguminosae: Papilionoideae), Biochem. Syst. Ecol., 1995, 23, 5, 547-553, https://doi.org/10.1016/0305-1978(95)00050-5 . [all data]