1-(5-methyl-2-furanyl)-1,2-propadione

Kovats' RI, non-polar column, temperature ramp

View large format table.

Column type Active phase I Reference Comment
CapillaryOV-1011155.Shibamoto, Kamiya, et al., 1981N2, 1. K/min; Column length: 80. m; Column diameter: 0.28 mm; Tstart: 80. C; Tend: 200. C

Kovats' RI, polar column, temperature ramp

View large format table.

Column type Active phase I Reference Comment
CapillaryCarbowax 20M1824.Shibamoto, Kamiya, et al., 1981N2, 2. K/min; Column length: 50. m; Column diameter: 0.28 mm; Tstart: 80. C; Tend: 200. C

Van Den Dool and Kratz RI, polar column, custom temperature program

View large format table.

Column type Active phase I Reference Comment
CapillaryCarbowax1853.Baltes w. and Bochmann G., 1987Column diameter: 0.3 mm; Program: not specified
CapillaryCarbowax1853.Baltes w. and Bochmann G., 1987Column diameter: 0.3 mm; Program: not specified
CapillaryCarbowax1853.Baltes w. and Bochmann G., 1987Column diameter: 0.3 mm; Program: not specified
CapillaryCarbowax1854.Baltes w. and Bochmann G., 1987Column diameter: 0.3 mm; Program: not specified
CapillaryCarbowax1857.Baltes w. and Bochmann G., 1987Column diameter: 0.3 mm; Program: not specified

References

Shibamoto, Kamiya, et al., 1981
Shibamoto, T.; Kamiya, Y.; Mihara, S., Isolation and identification of volatile compounds in cooked meat: sukiyaki, J. Agric. Food Chem., 1981, 29, 1, 57-63, https://doi.org/10.1021/jf00103a015 . [all data]

Baltes w. and Bochmann G., 1987
Baltes w.; Bochmann G., Model reactions on roast aroma formation. II. Mass spectrometric identification of furans and furanones from the reaction of serine and threonine with sucrose under the conditions of coffee roasting, Z. Lebensm. Unters. Forsch., 1987, 184, 179-186. [all data]