2'-Deoxyuridine, 3'-O-TBDMS

Kovats' RI, non-polar column, isothermal

Data compiled by: NIST Mass Spectrometry Data Center, William E. Wallace, director

Column type Packed
Active phase OV-1
Column length (m)
Carrier gas N2
Substrate Gas-Chrom Q
Column diameter (mm)
Phase thickness (μm)
Temperature (C) 230.
I 2558.
ReferenceQuilliam, Ogilvie, et al., 1980
Comment MSDC-RI

References

Quilliam, Ogilvie, et al., 1980
Quilliam, M.A.; Ogilvie, K.K.; Sadana, K.L.; Westmore, J.B., Gas chromatographic retention data for silyl and acyl derivatives of nucleosides, J. Chromatogr., 1980, 196, 3, 367-378, https://doi.org/10.1016/S0021-9673(00)84739-1 . [all data]